Package Details: haveno 1.0.18-1

Git Clone URL: https://aur.archlinux.org/haveno.git (read-only, click to copy)
Package Base: haveno
Description: Decentralised P2P exchange built on Monero and Tor.
Upstream URL: https://github.com/haveno-dex/haveno
Licenses: AGPL-3.0-or-later
Submitter: Spixmaster
Maintainer: Spixmaster
Last Packager: Spixmaster
Votes: 3
Popularity: 0.010960
First Submitted: 2022-10-02 20:03 (UTC)
Last Updated: 2025-01-21 09:20 (UTC)

Dependencies (3)

Required by (0)

Sources (2)

Latest Comments

1 2 Next › Last »

Spixmaster commented on 2025-02-15 12:08 (UTC)

I think I already had a similar issue. Try to remove the cache before. Something like rm -r ~/.cache/paru/clone/haveno/ for paru.

qw99 commented on 2025-02-15 11:48 (UTC)

FAILURE: Build failed with an exception.

* What went wrong:
Cannot create service of type CacheConfigurationsInternal using method GradleUserHomeScopeServices.createCachesConfiguration() as there is a problem with parameter #1 of type ObjectFactory.
> Cannot create service of type ObjectFactory using method GlobalScopeServices.createObjectFactory() as there is a problem with parameter #3 of type DirectoryFileTreeFactory.
   > Cannot create service of type DirectoryFileTreeFactory using method BasicGlobalScopeServices.createDirectoryFileTreeFactory() as there is a problem with parameter #1 of type Factory<PatternSet>.
      > Cannot create service of type Factory<PatternSet> using method BasicGlobalScopeServices.createPatternSetFactory() as there is a problem with parameter #1 of type PatternSpecFactory.
         > Multiple services of type PatternSpecFactory available in DaemonServices:
              - Service PatternSpecFactory at BasicGlobalScopeServices.createPatternSpecFactory()
              - Service PatternSpecFactory at GlobalScopeServices.createPatternSpecFactory()

* Try:
> Run with --stacktrace option to get the stack trace.
> Run with --info or --debug option to get more log output.
> Run with --scan to get full insights.
> Get more help at https://help.gradle.org.

BUILD FAILED in 250ms
==> ERROR: A failure occurred in build().
    Aborting...
 -> error making: haveno-exit status 4
removing untracked AUR files from cache...
:: Cleaning (1/1): /run/user/1000/yay/haveno
Removing haveno-v1.0.18.tar.gz
 -> Failed to install the following packages. Manual intervention is required:
haveno - exit status 4

revsuine commented on 2025-01-21 00:02 (UTC)

haveno-v1.0.18.tar.gz is failing the validity check for me

kingdomkind commented on 2024-12-19 17:40 (UTC)

Thanks for the response and help! I can confirm the command worked & was correct, and built correctly!

Spixmaster commented on 2024-12-19 07:19 (UTC)

@kingdomkind, the error happens due to the wrong selection of the Java version. Java 21 will work if I remember correctly. Run sudo archlinux-java set java-21-openjdk. Older versions should be possible too.

kingdomkind commented on 2024-12-18 21:56 (UTC)

Hi, I'm getting:

FAILURE: Build failed with an exception.

  • What went wrong: Could not open settings generic class cache for settings file '/home/pika/.aur/haveno/src/haveno-1.0.14/settings.gradle' (/home/pika/.gradle/caches/8.6/scripts/2ii5klxjjq1d8e574diplcyy2).

    BUG! exception in phase 'semantic analysis' in source unit 'BuildScript' Unsupported class file major version 67

Does anyone know why? Thank you.

Spixmaster commented on 2024-06-20 15:52 (UTC)

Fixed it. That happens from time to time. Maybe, a different commit was tagged with the same tag and the old one deleted before.

charliecharlie commented on 2024-06-20 15:43 (UTC)

Validation failure for 1 package, why is this?

Validating source files with sha512sums... haveno-v1.0.7.tar.gz ... FAILED haveno.desktop ... Passed ==> ERROR: One or more files did not pass the validity check!

dujemiha commented on 2024-05-30 08:42 (UTC)

@Spixmaster Thank you! I have uploaded the package here.

Spixmaster commented on 2024-05-29 22:09 (UTC)

@dujemiha I have no problem with that. I have never heard before of that project. Thanks for asking.