is it possible to get the 4.10-rc5 now? I have an A10-8700p and this was the only kernel version so far that I could use amdgpu with dpm and runpm disabled..
I'm fed up with Vesa... :'( xD
Search Criteria
Package Details: linux-mainline 6.15rc3-1
Package Actions
Git Clone URL: | https://aur.archlinux.org/linux-mainline.git (read-only, click to copy) |
---|---|
Package Base: | linux-mainline |
Description: | The Linux Mainline kernel and modules |
Upstream URL: | https://kernel.org/ |
Licenses: | GPL-2.0-only |
Provides: | KSMBD-MODULE, NTSYNC-MODULE, VIRTUALBOX-GUEST-MODULES, WIREGUARD-MODULE |
Replaces: | virtualbox-guest-modules-arch, wireguard-arch |
Submitter: | miffe |
Maintainer: | miffe |
Last Packager: | miffe |
Votes: | 290 |
Popularity: | 1.52 |
First Submitted: | 2011-07-22 06:50 (UTC) |
Last Updated: | 2025-04-21 02:53 (UTC) |
Dependencies (24)
- coreutils (coreutils-gitAUR, coreutils-selinuxAUR, coreutils-uutilsAUR, coreutils-uutils-symlinkAUR)
- initramfs (booster-gitAUR, booster-wip-gitAUR, dracut-gitAUR, mkinitcpio-gitAUR, ugrd-gitAUR, booster, dracut, mkinitcpio)
- kmod (kmod-gitAUR)
- bc (bc-ghAUR) (make)
- cpio (cpio-gitAUR) (make)
- gettext (gettext-gitAUR) (make)
- git (git-gitAUR, git-glAUR) (make)
- graphviz (make)
- imagemagick (imagemagick-gitAUR, imagemagick-full-gitAUR, imagemagick-fullAUR) (make)
- libelf (elfutils-gitAUR) (make)
- pahole (pahole-gitAUR) (make)
- perl (perl-gitAUR) (make)
- python (python37AUR, python311AUR, python310AUR) (make)
- python-sphinx (python-sphinx-gitAUR) (make)
- python-yaml (python-yaml-gitAUR) (make)
- rust (rustup-gitAUR, rust-nightly-binAUR, rust-gitAUR, rust-beta-binAUR, rustup-stubAUR, rustup) (make)
- rust-bindgen (rust-bindgen-gitAUR) (make)
- rust-src (rustup-gitAUR, rust-src-gitAUR, rustup) (make)
- tar (tar-gitAUR) (make)
- texlive-latexextra (texlive-dummyAUR, texlive-installerAUR, texlive-fullAUR) (make)
- xz (xz-gitAUR) (make)
- linux-firmware (linux-libre-firmwareAUR, linux-firmware-uncompressedAUR, linux-firmware-gitAUR) (optional) – firmware images needed for some devices
- scx-scheds (scx-scheds-gitAUR) (optional) – to use sched-ext schedulers
- wireless-regdb (optional) – to set the correct wireless channels of your country
Required by (8)
- ksmbd-tools (requires KSMBD-MODULE)
- mullvad-wg.sh-git (requires WIREGUARD-MODULE) (optional)
- piavpn-bin (requires WIREGUARD-MODULE) (optional)
- piavpn-manual-git (requires WIREGUARD-MODULE)
- virtualbox-guest-utils-nox-svn (requires VIRTUALBOX-GUEST-MODULES)
- virtualbox-guest-utils-svn (requires VIRTUALBOX-GUEST-MODULES)
- wine-osu-spectator (requires NTSYNC-MODULE) (optional)
- wine-osu-spectator-wow64 (requires NTSYNC-MODULE) (optional)
Sources (2)
Latest Comments
« First ‹ Previous 1 .. 37 38 39 40 41 42 43 44 45 46 47 .. 93 Next › Last »
<deleted-account> commented on 2017-03-12 21:57 (UTC)
miffe commented on 2017-02-12 16:43 (UTC)
@zeroxfourc: Remove the src directory.
<deleted-account> commented on 2017-02-12 13:20 (UTC)
There seems to be something wrong with the patch...
==> Starting prepare()...
patching file .mailmap
patching file CREDITS
patching file Documentation/00-INDEX
patching file Documentation/ABI/README
patching file Documentation/ABI/stable/sysfs-devices
patching file Documentation/ABI/testing/sysfs-block
The next patch would create the file Documentation/ABI/testing/sysfs-bus-fsl-mc,
which already exists! Assume -R? [n]
agapito commented on 2017-02-01 05:42 (UTC)
My system was correctly updated. I tried to compile it again and now works. I don't know what happened.
miffe commented on 2017-01-31 20:50 (UTC)
agapito: Make sure your system is correctly updated, your bash or ncurses seems out of date.
agapito commented on 2017-01-31 17:49 (UTC)
Can't compile it:
LD fs/coda/built-in.o
CC [M] fs/coda/psdev.o
CC kernel/time/tick-broadcast-hrtimer.o
/bin/sh: error while loading shared libraries: libncursesw.so.6: cannot open shared object file: No such file or directory
make[2]: *** [scripts/Makefile.build:293: fs/ceph/addr.o] Error 127
make[1]: *** [scripts/Makefile.build:551: fs/ceph] Error 2
make[1]: *** Se espera a que terminen otras tareas....
/bin/sh: error while loading shared libraries: libncursesw.so.6: cannot open shared object file: No such file or directory
make[2]: *** [scripts/Makefile.build:293: kernel/time/tick-oneshot.o] Error 127
make[1]: *** [scripts/Makefile.build:551: kernel/time] Error 2
make[1]: *** Se espera a que terminen otras tareas....
/bin/sh: error while loading shared libraries: libncursesw.so.6: cannot open shared object file: No such file or directory
make[2]: *** [scripts/Makefile.build:293: kernel/trace/ring_buffer.o] Error 127
make[1]: *** [scripts/Makefile.build:551: kernel/trace] Error 2
/bin/sh: error while loading shared libraries: libncursesw.so.6: cannot open shared object file: No such file or directory
make[2]: *** [scripts/Makefile.build:293: kernel/sched/cpupri.o] Error 127
make[2]: *** Se espera a que terminen otras tareas....
/bin/sh: error while loading shared libraries: libncursesw.so.6: cannot open shared object file: No such file or directory
/bin/sh: error while loading shared libraries: libncursesw.so.6: cannot open shared object file: No such file or directory
/bin/sh: error while loading shared libraries: libncursesw.so.6: cannot open shared object file: No such file or directory
make[2]: *** [scripts/Makefile.build:294: fs/cifs/cifssmb.o] Error 127
make[2]: *** Se espera a que terminen otras tareas....
make[2]: *** [scripts/Makefile.build:294: fs/cifs/cifs_debug.o] Error 127
make[2]: *** [scripts/Makefile.build:293: fs/coda/cache.o] Error 127
make[2]: *** Se espera a que terminen otras tareas....
/bin/sh: error while loading shared libraries: libncursesw.so.6: cannot open shared object file: No such file or directory
make[3]: *** [scripts/Makefile.build:293: arch/x86/events/intel/bts.o] Error 127
make[3]: *** Se espera a que terminen otras tareas....
/bin/sh: error while loading shared libraries: libncursesw.so.6: cannot open shared object file: No such file or directory
/bin/sh: error while loading shared libraries: libncursesw.so.6: cannot open shared object file: No such file or directory
make[2]: *** [scripts/Makefile.build:300: arch/x86/events/amd/power.o] Error 127
make[2]: *** Se espera a que terminen otras tareas....
make[2]: *** [scripts/Makefile.build:293: fs/btrfs/print-tree.o] Error 127
make[2]: *** Se espera a que terminen otras tareas....
/bin/sh: error while loading shared libraries: libncursesw.so.6: cannot open shared object file: No such file or directory
/bin/sh: error while loading shared libraries: libncursesw.so.6: cannot open shared object file: No such file or directory
/bin/sh: error while loading shared libraries: libncursesw.so.6: cannot open shared object file: No such file or directory
/bin/sh: error while loading shared libraries: libncursesw.so.6: cannot open shared object file: No such file or directory
/bin/sh: error while loading shared libraries: libncursesw.so.6: cannot open shared object file: No such file or directory
make[1]: *** [scripts/Makefile.build:293: mm/mprotect.o] Error 127
make[1]: *** Se espera a que terminen otras tareas....
make[2]: *** [scripts/Makefile.build:293: arch/x86/ia32/sys_ia32.o] Error 127
make: *** [Makefile:988: mm] Error 2
make: *** Se espera a que terminen otras tareas....
make[1]: *** [scripts/Makefile.build:551: arch/x86/ia32] Error 2
make[1]: *** Se espera a que terminen otras tareas....
/bin/sh: error while loading shared libraries: libncursesw.so.6: cannot open shared object file: No such file or directory
make[2]: *** [scripts/Makefile.build:294: arch/x86/kernel/process_64.o] Error 127
make[2]: *** Se espera a que terminen otras tareas....
/bin/sh: error while loading shared libraries: libncursesw.so.6: cannot open shared object file: No such file or directory
make[2]: *** [scripts/Makefile.build:294: arch/x86/kernel/signal.o] Error 127
make[1]: *** [scripts/Makefile.build:551: arch/x86/kernel] Error 2
make[1]: *** [scripts/Makefile.build:551: fs/coda] Error 2
make[1]: *** [scripts/Makefile.build:551: kernel/sched] Error 2
make: *** [Makefile:988: kernel] Error 2
make[2]: *** [scripts/Makefile.build:551: arch/x86/events/intel] Error 2
make[1]: *** [scripts/Makefile.build:551: arch/x86/events] Error 2
make: *** [Makefile:988: arch/x86] Error 2
make[1]: *** [scripts/Makefile.build:551: fs/cifs] Error 2
make[1]: *** [scripts/Makefile.build:551: fs/btrfs] Error 2
make: *** [Makefile:988: fs] Error 2
ishitatsuyuki commented on 2017-01-09 08:00 (UTC)
Along with the update, please also merge stock configs. BBR is just a part of amazing features, I need ISH support as well.
darkbasic commented on 2016-12-23 16:04 (UTC)
We have 4.9 in testing, should be safe to update the config files now.
quest commented on 2016-12-20 23:06 (UTC)
+1 on defaulting to BBR enabled. I have a feeling that everyone is flocking to 4.9 to test it out, and in my case the new nvme support. =)
Pinned Comments
miffe commented on 2020-01-30 21:44 (UTC)
Repository here