Package Details: libresprite 1:1.1+dev-2

Git Clone URL: https://aur.archlinux.org/libresprite.git (read-only, click to copy)
Package Base: libresprite
Description: Animated sprite editor & pixel art tool -- Fork of the last GPLv2 commit of Aseprite
Upstream URL: https://github.com/LibreSprite/LibreSprite
Keywords: gamedev pixel sprites
Licenses: GPL
Conflicts: libresprite-appimage
Submitter: bell0x07
Maintainer: Eragon
Last Packager: Eragon
Votes: 15
Popularity: 0.103148
First Submitted: 2018-06-19 10:54 (UTC)
Last Updated: 2023-12-20 23:36 (UTC)

Latest Comments

« First ‹ Previous 1 2 3 Next › Last »

Eragon commented on 2023-08-31 21:51 (UTC)

Isn't git an implicit dependency when you're using the AUR ? I'll add it anyway. Thanks for the log. I don't have a "clean" arch to test my packages and I am not really using libresprite anymore. For cstdint you should report that back upstream, but it's probably due to the fact that they hadn't released anything since 2021 and Glibc got updated since, it's probably better for everyone to use the -git package instead. Or ask for a new release upstream.

Eragon commented on 2021-12-19 14:36 (UTC)

I've updated this to the latest release. (v1.0) And fixed the epoch number.

FabioLolix commented on 2021-12-19 13:22 (UTC)

Hello, this need epoch=1 since 1.0 is inferior to 1.1.7

tiziodcaio commented on 2021-12-18 19:38 (UTC)

Use libresprite-appimage or libresprite-git instead

tiko commented on 2021-10-14 14:53 (UTC)

Please update to version v1.0-beta.1

pickfire commented on 2021-06-16 15:55 (UTC)

Still seemed to fail to build up till now.

Tio commented on 2020-10-31 19:08 (UTC)

Error:

make[3]: *** [src/she/CMakeFiles/she.dir/build.make:121: src/she/CMakeFiles/she.dir/alleg4/display_events.cpp.o] Error 1
make[3]: *** [src/she/CMakeFiles/she.dir/build.make:134: src/she/CMakeFiles/she.dir/alleg4/key_poller.cpp.o] Error 1
make[3]: *** [src/she/CMakeFiles/she.dir/build.make:108: src/she/CMakeFiles/she.dir/alleg4/alleg_surface.cpp.o] Error 1
make[3]: *** [src/she/CMakeFiles/she.dir/build.make:160: src/she/CMakeFiles/she.dir/alleg4/she.cpp.o] Error 1
make[3]: *** [src/she/CMakeFiles/she.dir/build.make:95: src/she/CMakeFiles/she.dir/alleg4/alleg_display.cpp.o] Error 1
make[2]: *** [CMakeFiles/Makefile2:1129: src/she/CMakeFiles/she.dir/all] Error 2
make[2]: *** Waiting for unfinished jobs....
[ 37%] Linking C static library ../../lib/libduktape.a
[ 37%] Built target duktape
make[1]: *** [CMakeFiles/Makefile2:625: src/CMakeFiles/aseprite.dir/rule] Error 2
make: *** [Makefile:194: aseprite] Error 2
==> ERROR: A failure occurred in build().
    Aborting...

MintStudios commented on 2020-10-16 15:17 (UTC)

I've just adopted this package, I'm redoing this now.

FFY00 commented on 2020-10-16 14:17 (UTC)

Please do not use git submodule update --init --recursive.

Refeer to https://wiki.archlinux.org/index.php/VCS_package_guidelines#Git_Submodules for the guidelines and an example how to use submodules correctly.