Package Details: lmms-git 1.3.0.alpha.1.r236.g20baf96db-1

Git Clone URL: https://aur.archlinux.org/lmms-git.git (read-only, click to copy)
Package Base: lmms-git
Description: The Linux MultiMedia Studio.
Upstream URL: https://lmms.io
Licenses: GPL2
Conflicts: lmms
Provides: lmms
Submitter: Wintervenom
Maintainer: MrSoup678
Last Packager: MrSoup678
Votes: 32
Popularity: 0.000284
First Submitted: 2009-04-19 19:14 (UTC)
Last Updated: 2022-12-04 15:30 (UTC)

Required by (3)

Sources (3)

Latest Comments

« First ‹ Previous 1 2 3 4 5 6 7 Next › Last »

Xyne commented on 2016-04-14 23:22 (UTC)

@Xylemon I try to follow the official package as closely as possible. The optdeps have been updated to match. It makes no sense to add ALSA or OSS to the optdeps: there is no single package for either nor a virtual "provided" package (such as e.g. java-runtime). Besides, optdeps are for packages that are not required but which extend or enhance the functionality of the package. Being able to interface with various backends to provide sound is not an extension, just a way to provide the same thing by different means. At least one sound system is expected and for an audio package sound would presumably be a dep, not an optdep ;)

Xylemon commented on 2016-04-08 18:02 (UTC)

Could you add OSS, ALSA, and Pulse to the optional deps? These all have backends in LMMS. Also isn't JACK completely optional as well?

hickop commented on 2015-05-10 18:46 (UTC)

gcc-multilib is required to build vst plugin.

njeno commented on 2014-06-05 23:01 (UTC)

I found that we'll need a flag "-Wno-aggressive-loop-optimizations" for newer gcc and for 64 bit for vst_base we'll need "-D HXCPP_M64" flag

Xyne commented on 2014-06-05 18:30 (UTC)

The build fails here too. I'll try to fix it this weekend if I have time. Please submit a patch if you create one.

njeno commented on 2014-06-02 10:24 (UTC)

I got the following error: [ 55%] Building C object plugins/LadspaEffect/swh/CMakeFiles/bode_shifter_cv_1432.dir/bode_shifter_cv_1432.o bode_shifter_cv_1432.xml: In function ‘runAddingBodeShifterCV’: bode_shifter_cv_1432.xml:89:22: error: iteration 100u invokes undefined behavior [-Werror=aggressive-loop-optimizations] bode_shifter_cv_1432.xml:88:4: note: containing loop bode_shifter_cv_1432.xml: In function ‘runBodeShifterCV’: bode_shifter_cv_1432.xml:89:22: error: iteration 100u invokes undefined behavior [-Werror=aggressive-loop-optimizations] bode_shifter_cv_1432.xml:88:4: note: containing loop cc1: all warnings being treated as errors plugins/LadspaEffect/swh/CMakeFiles/bode_shifter_cv_1432.dir/build.make:57: recipe for target 'plugins/LadspaEffect/swh/CMakeFiles/bode_shifter_cv_1432.dir/bode_shifter_cv_1432.o' failed make[2]: *** [plugins/LadspaEffect/swh/CMakeFiles/bode_shifter_cv_1432.dir/bode_shifter_cv_1432.o] Error 1 CMakeFiles/Makefile2:3214: recipe for target 'plugins/LadspaEffect/swh/CMakeFiles/bode_shifter_cv_1432.dir/all' failed make[1]: *** [plugins/LadspaEffect/swh/CMakeFiles/bode_shifter_cv_1432.dir/all] Error 2 Makefile:136: recipe for target 'all' failed make: *** [all] Error 2

Xyne commented on 2014-04-12 01:24 (UTC)

This package is not out-of-date. I am able to build the latest version without issue. If you are having problems, please post a pastebin link to the exact error messages.

funkmuscle commented on 2014-04-05 17:37 (UTC)

yep 1.0.0 is out but can anyone build it? I've tried and it keeps failing. something to do with RemoteVSTClient

OramahMaalhur commented on 2014-04-04 20:16 (UTC)

1.0.0 is out!